{"text_format":"1","workbook":"xlsx","n_sheets":11,"sheets":["Instructions","STTD P Energy equation","NRC 2012","Finisher Model - NE Metric","Current Performance - NE ","FW - Projected Performance - NE","FT - Projected Performance - NE","Finisher Model - ME Metric","Current Performance - ME","FW - Projected Performance - ME","FT - Projected Performance - ME"],"not_rendered":{"charts":3,"images":2,"macros":1,"external_links":1,"defined_names":1,"comments":2,"pivot_tables":0},"unopened":[],"bounds":{"document_bytes":16777216,"sheet_cells":100000,"rows_first":2000,"rows_last":500,"rows_between":2000,"halvings":0,"cell_chars":16384,"cell_head_chars":4096},"cells_cut":0,"cells_raw":0,"read":"whole","date_system":"1900"}

{"sheet":"Instructions","index":0,"n_rows":1,"n_cols":1,"rows_kept":1,"cut":false,"hidden":false,"merged":[[0,0,1,10]]}
["            Economic model for optimum phosphorus level "]

{"sheet":"STTD P Energy equation","index":1,"n_rows":8,"n_cols":12,"rows_kept":8,"cut":false,"hidden":true,"merged":[]}
[]
[null,null,null,"Trial"]
["Start_wt_kg","End_wt_kg","Avg wt_kg","Avg_NE_kcal_kg","Avg_NE_kcal_lb","STTD P req","STTDP_NE_kg","Total P","TotalP_NE_kg","Avg_ME_kcal_kg","Avg_ME_kcal_lb","STTD P_ME_kg"]
[11.33980925,24.176473321000003,17.758141285500002,2410,1093,0.43,{"$f":"(F4/D4)*10000","v":1.7842323651452281},0.69,{"$f":"(H4/D4)*10000","v":2.8630705394190867},3265,1481,{"$f":"(F4/J4)*10000","v":1.3169984686064318}]
[24.176473321000003,49.078694434000006,36.627583877500001,2429,1101.6580186568638,0.38,{"$f":"(F5/D5)*10000","v":1.5644298065047344},0.64,{"$f":"(H5/D5)*10000","v":2.6348291477974475},3285,1489.6730937961286,{"$f":"(F5/J5)*10000","v":1.1567732115677321}]
[49.078694434000006,77.337499085000005,63.208096759499995,2496,1131.5498008628074,0.33,{"$f":"(F6/D6)*10000","v":1.3221153846153846},0.56000000000000005,{"$f":"(H6/D6)*10000","v":2.2435897435897441},3300,1496.7264061682447,1]
{"$rows_left_out":3}
{"sheet":"NRC 2012","index":2,"n_rows":55,"n_cols":15,"rows_kept":55,"cut":false,"hidden":true,"merged":[[2,1,2,14],[4,1,4,2],[5,1,5,2],[4,3,4,4],[5,3,5,4],[4,5,4,6],[4,7,4,8],[5,5,5,6],[5,7,5,8],[5,9,5,10],[5,11,5,12],[5,13,5,14],[4,9,4,10],[4,11,4,12],[4,13,4,14]]}
[]
["NRC, 2012. Table 16-1A"]
[null,"Body Weight Range, Kg"]
["Item:",5,7,7,11,11,25,25,50,50,75,75,100,100,135]
["Avg. wt, calculated",6,null,9,null,18,null,37.5,null,62.5,null,87.5,null,117.5]
["P, STTD",0.45,null,0.4,null,0.33,null,0.31,null,0.27,null,0.24,null,0.21]
{"$rows_left_out":50}
{"sheet":"Finisher Model - NE Metric","index":3,"n_rows":66,"n_cols":29,"rows_kept":66,"cut":false,"hidden":false,"merged":[[0,0,1,9],[5,0,5,2],[14,4,14,5],[36,23,36,24],[5,23,5,24],[9,23,9,24],[13,23,13,24],[17,23,17,24],[21,23,21,24],[27,5,27,7],[38,17,38,18],[39,17,39,18],[37,17,37,19],[13,0,13,2],[6,0,6,2],[7,0,7,2],[9,0,9,2],[10,0,10,2],[8,0,8,2],[23,1,23,3],[14,7,14,8],[24,1,24,3],[25,1,25,3],[23,5,23,7],[24,5,24,7],[25,5,25,7]]}
["            Economic model for optimum phosphorus levels"]
[]
[]
["Input (please fill yellow cells)",null,null,null,null,null,null,null,null,null,null,null,null,null,null,null,null,null,null,null,null,null,"STTD P","0.000047291257153852600x2 - 0.014390782029002800000x + 2.027514542222900000000"]
[]
["Economic evaluation criteria",null,null,null,null,null,null,null,null,null,null,null,null,null,null,null,null,null,null,null,null,null,null,"Slot (Phase) 1"]
{"$rows_left_out":61}
{"sheet":"Current Performance - NE ","index":4,"n_rows":96,"n_cols":16,"rows_kept":96,"cut":false,"hidden":true,"merged":[[39,1,39,4],[0,0,0,14],[1,0,3,0],[1,9,2,10],[38,1,38,4],[1,1,2,6]]}
["Economic model for optimum phosphorus level - Model Calculations by phase"]
["Item","Dietary phase",null,null,null,null,null,null,null,"Summary of Calculations with Current Phosphorus Levels"]
[]
[null,1,2,3,4,5,6,null,null,"Item","Output",2,3,4,5,6]
["Starting weight, kg",{"$f":"'Finisher Model - NE Metric'!B17","v":0},{"$f":"'Finisher Model - NE Metric'!B18","v":0},{"$f":"'Finisher Model - NE Metric'!B19","v":0},{"$f":"'Finisher Model - NE Metric'!B20","v":0},{"$f":"'Finisher Model - NE Metric'!B21","v":0},{"$f":"'Finisher Model - NE Metric'!B22","v":0},null,null,"Predicted ADG, g",{"$f":"IF('Finisher Model - NE Metric'!$D$11=2,'Current Performance - NE '!L5,IF('Finisher Model - NE Metric'!$D$11=3,'Current Performance - NE '!M5,IF('Finisher Model - NE Metric'!$D$11=4,'Current Performance - NE '!N5,IF('Finisher Model - NE Metric'!$D$11=5,'Current Performance - NE '!O5,IF('Finisher Model - NE Metric'!$D$11=6,'Current Performance - NE '!P5,\"\")))))","v":""},{"$f":"((SUMPRODUCT($B$11:$C$11,$B$16:$C$16)/SUM($B$16:$C$16))/1000)","v":{"$error":"#VALUE!"}},{"$f":"((SUMPRODUCT($B$11:$D$11,$B$16:$D$16)/SUM($B$16:$D$16))/1000)","v":{"$error":"#VALUE!"}},{"$f":"((SUMPRODUCT($B$11:$E$11,$B$16:$E$16)/SUM($B$16:$E$16))/1000)","v":{"$error":"#VALUE!"}},{"$f":"((SUMPRODUCT($B$11:$F$11,$B$16:$F$16)/SUM($B$16:$F$16))/1000)","v":{"$error":"#VALUE!"}},{"$f":"((SUMPRODUCT($B$11:$G$11,$B$16:$G$16)/SUM($B$16:$G$16))/1000)","v":{"$error":"#VALUE!"}}]
["Final weight, kg",{"$f":"'Finisher Model - NE Metric'!C17","v":0},{"$f":"'Finisher Model - NE Metric'!C18","v":0},{"$f":"'Finisher Model - NE Metric'!C19","v":0},{"$f":"'Finisher Model - NE Metric'!C20","v":0},{"$f":"'Finisher Model - NE Metric'!C21","v":0},{"$f":"'Finisher Model - NE Metric'!C22","v":0},null,null,"Predicted F/G",{"$f":"IF('Finisher Model - NE Metric'!$D$11=2,'Current Performance - NE '!L6,IF('Finisher Model - NE Metric'!$D$11=3,'Current Performance - NE '!M6,IF('Finisher Model - NE Metric'!$D$11=4,'Current Performance - NE '!N6,IF('Finisher Model - NE Metric'!$D$11=5,'Current Performance - NE '!O6,IF('Finisher Model - NE Metric'!$D$11=6,'Current Performance - NE '!P6,\"\")))))","v":""},{"$f":"SUM($B$17:$C$17)/SUM($B$19:$C$19)","v":{"$error":"#VALUE!"}},{"$f":"SUM($B$17:$D$17)/SUM($B$19:$D$19)","v":{"$error":"#VALUE!"}},{"$f":"SUM($B$17:$E$17)/SUM($B$19:$E$19)","v":{"$error":"#VALUE!"}},{"$f":"SUM($B$17:$F$17)/SUM($B$19:$F$19)","v":{"$error":"#VALUE!"}},{"$f":"SUM($B$17:$G$17)/SUM($B$19:$G$19)","v":{"$error":"#VALUE!"}}]
{"$rows_left_out":91}
{"sheet":"FW - Projected Performance - NE","index":5,"n_rows":104,"n_cols":16,"rows_kept":104,"cut":false,"hidden":true,"merged":[[62,3,62,5],[62,8,63,8],[49,1,49,4],[0,0,0,14],[1,0,3,0],[1,9,2,10],[48,1,48,4],[1,1,2,6],[48,6,48,9],[49,6,49,9]]}
["Economic model for optimum phosphorus level - Model Calculations by phase"]
["Item","Dietary phase",null,null,null,null,null,null,null,"Summary of Calculations with Current Phosphorus Levels"]
[]
[null,1,2,3,4,5,6,null,null,"Item","Output",2,3,4,5,6]
["Starting weight, kg",{"$f":"'Finisher Model - NE Metric'!B17","v":0},{"$f":"'Finisher Model - NE Metric'!B18","v":0},{"$f":"'Finisher Model - NE Metric'!B19","v":0},{"$f":"'Finisher Model - NE Metric'!B20","v":0},{"$f":"'Finisher Model - NE Metric'!B21","v":0},{"$f":"'Finisher Model - NE Metric'!B22","v":0},null,null,"Live"]
["Final weight, kg",{"$f":"'Finisher Model - NE Metric'!C17","v":0},{"$f":"'Finisher Model - NE Metric'!C18","v":0},{"$f":"'Finisher Model - NE Metric'!C19","v":0},{"$f":"'Finisher Model - NE Metric'!C20","v":0},{"$f":"'Finisher Model - NE Metric'!C21","v":0},{"$f":"'Finisher Model - NE Metric'!C22","v":0},null,null,"Predicted ADG, kg",{"$f":"IF('Finisher Model - NE Metric'!$D$11=2,L6,IF('Finisher Model - NE Metric'!$D$11=3,M6,IF('Finisher Model - NE Metric'!$D$11=4,N6,IF('Finisher Model - NE Metric'!$D$11=5,O6,IF('Finisher Model - NE Metric'!$D$11=6,P6,\"\")))))","v":""},{"$f":"((SUM($B$22:$C$22)/SUM(B16:C16)))","v":{"$error":"#VALUE!"}},{"$f":"((SUM($B$22:$D$22)/SUM(B16:D16)))","v":{"$error":"#VALUE!"}},{"$f":"((SUM($B$22:$E$22)/SUM(B16:E16)))","v":{"$error":"#VALUE!"}},{"$f":"((SUM($B$22:$F$22)/SUM(B16:F16)))","v":{"$error":"#VALUE!"}},{"$f":"((SUM($B$22:$G$22)/SUM(B16:G16)))","v":{"$error":"#VALUE!"}}]
{"$rows_left_out":99}
{"sheet":"FT - Projected Performance - NE","index":6,"n_rows":94,"n_cols":16,"rows_kept":94,"cut":false,"hidden":true,"merged":[[52,3,52,5],[52,8,53,8],[37,1,37,4],[0,0,0,14],[1,0,3,0],[1,9,2,10],[36,1,36,4],[1,1,2,6]]}
["Economic model for optimum phosphorus level - Model Calculations by phase"]
["Item","Dietary phase",null,null,null,null,null,null,null,"Summary of Calculations with Current Phosphorus Levels"]
[]
[null,1,2,3,4,5,6,null,null,"Item","Output",2,3,4,5,6]
["Starting weight, kg",{"$f":"'Finisher Model - NE Metric'!B17","v":0},{"$f":"'Finisher Model - NE Metric'!B18","v":0},{"$f":"'Finisher Model - NE Metric'!B19","v":0},{"$f":"'Finisher Model - NE Metric'!B20","v":0},{"$f":"'Finisher Model - NE Metric'!B21","v":0},{"$f":"'Finisher Model - NE Metric'!B22","v":0},null,null,"Predicted ADG, kg",{"$f":"IF('Finisher Model - NE Metric'!$D$11=2,L5,IF('Finisher Model - NE Metric'!$D$11=3,M5,IF('Finisher Model - NE Metric'!$D$11=4,N5,IF('Finisher Model - NE Metric'!$D$11=5,O5,IF('Finisher Model - NE Metric'!$D$11=6,P5,\"\")))))","v":""},{"$f":"((SUM(B19:C19)/SUM(B16:C16)))","v":{"$error":"#VALUE!"}},{"$f":"((SUM(B19:D19)/SUM(B16:D16)))","v":{"$error":"#VALUE!"}},{"$f":"SUM(B19:E19)/SUM(B16:E16)","v":{"$error":"#VALUE!"}},{"$f":"SUM(B19:F19)/SUM(B16:F16)","v":{"$error":"#VALUE!"}},{"$f":"SUM(B19:G19)/SUM(B16:G16)","v":{"$error":"#VALUE!"}}]
["Final weight, kg",{"$f":"'Finisher Model - NE Metric'!C17","v":0},{"$f":"'Finisher Model - NE Metric'!C18","v":0},{"$f":"'Finisher Model - NE Metric'!C19","v":0},{"$f":"'Finisher Model - NE Metric'!C20","v":0},{"$f":"'Finisher Model - NE Metric'!C21","v":0},{"$f":"'Finisher Model - NE Metric'!C22","v":0},null,null,"Predicted F/G",{"$f":"IF('Finisher Model - NE Metric'!$D$11=2,L6,IF('Finisher Model - NE Metric'!$D$11=3,M6,IF('Finisher Model - NE Metric'!$D$11=4,N6,IF('Finisher Model - NE Metric'!$D$11=5,O6,IF('Finisher Model - NE Metric'!$D$11=6,P6,\"\")))))","v":""},{"$f":"SUM($B$17:$C$17)/SUM($B$19:$C$19)","v":{"$error":"#VALUE!"}},{"$f":"SUM($B$17:$D$17)/SUM($B$19:$D$19)","v":{"$error":"#VALUE!"}},{"$f":"SUM($B$17:$E$17)/SUM($B$19:$E$19)","v":{"$error":"#VALUE!"}},{"$f":"SUM($B$17:$F$17)/SUM($B$19:$F$19)","v":{"$error":"#VALUE!"}},{"$f":"SUM($B$17:$G$17)/SUM($B$19:$G$19)","v":{"$error":"#VALUE!"}}]
{"$rows_left_out":89}
{"sheet":"Finisher Model - ME Metric","index":7,"n_rows":59,"n_cols":29,"rows_kept":59,"cut":false,"hidden":false,"merged":[[28,17,28,18],[29,17,29,18],[17,23,17,24],[21,23,21,24],[25,23,25,24],[27,17,27,19],[15,1,15,2],[0,0,1,8],[13,23,13,24],[5,23,5,24],[6,0,6,2],[7,0,7,2],[9,0,9,2],[10,0,10,2],[9,23,9,24],[13,0,13,2],[8,0,8,2],[5,0,5,2],[14,7,14,8],[14,4,14,5],[28,5,28,7],[24,1,24,3],[25,1,25,3],[26,1,26,3],[24,5,24,7],[25,5,25,7],[26,5,26,7]]}
["            Economic model for optimum phosphorus levels"]
[]
[]
["Input (please fill yellow cells)"]
[null,null,null,null,null,null,null,null,null,null,null,null,null,null,null,null,null,null,null,null,null,null,"STTD P","0.000030626936175869600x2 - 0.009664361472054440000x + 1.476750678631610000000"]
["Economic evaluation criteria",null,null,null,null,null,null,null,null,null,null,null,null,null,null,null,null,null,null,null,null,null,null,"Slot (Phase) 1"]
{"$rows_left_out":54}
{"sheet":"Current Performance - ME","index":8,"n_rows":96,"n_cols":16,"rows_kept":96,"cut":false,"hidden":true,"merged":[[39,1,39,4],[0,0,0,14],[1,0,3,0],[1,1,2,6],[1,9,2,10],[38,1,38,4]]}
["Economic model for optimum phosphorus level - Model Calculations by phase"]
["Item","Dietary phase",null,null,null,null,null,null,null,"Summary of Calculations with Current Phosphorus Levels"]
[]
[null,1,2,3,4,5,6,null,null,"Item","Output",2,3,4,5,6]
["Starting weight, kg",{"$f":"'Finisher Model - ME Metric'!B17","v":0},{"$f":"'Finisher Model - ME Metric'!B18","v":0},{"$f":"'Finisher Model - ME Metric'!B19","v":0},{"$f":"'Finisher Model - ME Metric'!B20","v":0},{"$f":"'Finisher Model - ME Metric'!B21","v":0},{"$f":"'Finisher Model - ME Metric'!B22","v":0},null,null,"Predicted ADG, kg",{"$f":"IF('Finisher Model - ME Metric'!$D$11=2,'Current Performance - ME'!L5,IF('Finisher Model - ME Metric'!$D$11=3,'Current Performance - ME'!M5,IF('Finisher Model - ME Metric'!$D$11=4,'Current Performance - ME'!N5,IF('Finisher Model - ME Metric'!$D$11=5,'Current Performance - ME'!O5,IF('Finisher Model - ME Metric'!$D$11=6,'Current Performance - ME'!P5,\"\")))))","v":""},{"$f":"((SUMPRODUCT($B$11:$C$11,$B$16:$C$16)/SUM($B$16:$C$16))/1000)","v":{"$error":"#VALUE!"}},{"$f":"((SUMPRODUCT($B$11:$D$11,$B$16:$D$16)/SUM($B$16:$D$16))/1000)","v":{"$error":"#VALUE!"}},{"$f":"((SUMPRODUCT($B$11:$E$11,$B$16:$E$16)/SUM($B$16:$E$16))/1000)","v":{"$error":"#VALUE!"}},{"$f":"((SUMPRODUCT($B$11:$F$11,$B$16:$F$16)/SUM($B$16:$F$16))/1000)","v":{"$error":"#VALUE!"}},{"$f":"((SUMPRODUCT($B$11:$G$11,$B$16:$G$16)/SUM($B$16:$G$16))/1000)","v":{"$error":"#VALUE!"}}]
["Final weight, kg",{"$f":"'Finisher Model - ME Metric'!C17","v":0},{"$f":"'Finisher Model - ME Metric'!C18","v":0},{"$f":"'Finisher Model - ME Metric'!C19","v":0},{"$f":"'Finisher Model - ME Metric'!C20","v":0},{"$f":"'Finisher Model - ME Metric'!C21","v":0},{"$f":"'Finisher Model - ME Metric'!C22","v":0},null,null,"Predicted F/G",{"$f":"IF('Finisher Model - ME Metric'!$D$11=2,'Current Performance - ME'!L6,IF('Finisher Model - ME Metric'!$D$11=3,'Current Performance - ME'!M6,IF('Finisher Model - ME Metric'!$D$11=4,'Current Performance - ME'!N6,IF('Finisher Model - ME Metric'!$D$11=5,'Current Performance - ME'!O6,IF('Finisher Model - ME Metric'!$D$11=6,'Current Performance - ME'!P6,\"\")))))","v":""},{"$f":"SUM($B$17:$C$17)/SUM($B$19:$C$19)","v":{"$error":"#VALUE!"}},{"$f":"SUM($B$17:$D$17)/SUM($B$19:$D$19)","v":{"$error":"#VALUE!"}},{"$f":"SUM($B$17:$E$17)/SUM($B$19:$E$19)","v":{"$error":"#VALUE!"}},{"$f":"SUM($B$17:$F$17)/SUM($B$19:$F$19)","v":{"$error":"#VALUE!"}},{"$f":"SUM($B$17:$G$17)/SUM($B$19:$G$19)","v":{"$error":"#VALUE!"}}]
{"$rows_left_out":91}
{"sheet":"FW - Projected Performance - ME","index":9,"n_rows":120,"n_cols":16,"rows_kept":120,"cut":false,"hidden":true,"merged":[[78,3,78,5],[78,8,79,8],[0,0,0,14],[1,0,3,0],[1,1,2,6],[1,9,2,10],[44,1,44,4],[45,1,45,4],[44,6,44,9],[45,6,45,9]]}
["Economic model for optimum phosphorus level - Model Calculations by phase"]
["Item","Dietary phase",null,null,null,null,null,null,null,"Summary of Calculations with Current Phosphorus Levels"]
[]
[null,1,2,3,4,5,6,null,null,"Item","Output",2,3,4,5,6]
["Starting weight, kg",{"$f":"'Finisher Model - ME Metric'!B17","v":0},{"$f":"'Finisher Model - ME Metric'!B18","v":0},{"$f":"'Finisher Model - ME Metric'!B19","v":0},{"$f":"'Finisher Model - ME Metric'!B20","v":0},{"$f":"'Finisher Model - ME Metric'!B21","v":0},{"$f":"'Finisher Model - ME Metric'!B22","v":0},null,null,"Live"]
["Final weight, kg",{"$f":"'Finisher Model - ME Metric'!C17","v":0},{"$f":"'Finisher Model - ME Metric'!C18","v":0},{"$f":"'Finisher Model - ME Metric'!C19","v":0},{"$f":"'Finisher Model - ME Metric'!C20","v":0},{"$f":"'Finisher Model - ME Metric'!C21","v":0},{"$f":"'Finisher Model - ME Metric'!C22","v":0},null,null,"Predicted ADG, kg",{"$f":"IF('Finisher Model - ME Metric'!$D$11=2,L6,IF('Finisher Model - ME Metric'!$D$11=3,M6,IF('Finisher Model - ME Metric'!$D$11=4,N6,IF('Finisher Model - ME Metric'!$D$11=5,O6,IF('Finisher Model - ME Metric'!$D$11=6,P6,\"\")))))","v":""},{"$f":"((SUM($B$22:$C$22)/SUM(B16:C16)))","v":{"$error":"#VALUE!"}},{"$f":"((SUM($B$22:$D$22)/SUM(B16:D16)))","v":{"$error":"#VALUE!"}},{"$f":"((SUM($B$22:$E$22)/SUM(B16:E16)))","v":{"$error":"#VALUE!"}},{"$f":"((SUM($B$22:$F$22)/SUM(B16:F16)))","v":{"$error":"#VALUE!"}},{"$f":"((SUM($B$22:$G$22)/SUM(B16:G16)))","v":{"$error":"#VALUE!"}}]
{"$rows_left_out":115}
{"sheet":"FT - Projected Performance - ME","index":10,"n_rows":94,"n_cols":16,"rows_kept":94,"cut":false,"hidden":true,"merged":[[52,3,52,5],[52,8,53,8],[0,0,0,14],[1,0,3,0],[1,1,2,6],[1,9,2,10],[36,1,36,4],[37,1,37,4]]}
["Economic model for optimum phosphorus level - Model Calculations by phase"]
["Item","Dietary phase",null,null,null,null,null,null,null,"Summary of Calculations with Current Phosphorus Levels"]
[]
[null,1,2,3,4,5,6,null,null,"Item","Output",2,3,4,5,6]
["Starting weight, kg",{"$f":"'Finisher Model - ME Metric'!B17","v":0},{"$f":"'Finisher Model - ME Metric'!B18","v":0},{"$f":"'Finisher Model - ME Metric'!B19","v":0},{"$f":"'Finisher Model - ME Metric'!B20","v":0},{"$f":"'Finisher Model - ME Metric'!B21","v":0},{"$f":"'Finisher Model - ME Metric'!B22","v":0},null,null,"Predicted ADG, kg",{"$f":"IF('Finisher Model - ME Metric'!$D$11=2,L5,IF('Finisher Model - ME Metric'!$D$11=3,M5,IF('Finisher Model - ME Metric'!$D$11=4,N5,IF('Finisher Model - ME Metric'!$D$11=5,O5,IF('Finisher Model - ME Metric'!$D$11=6,P5,\"\")))))","v":""},{"$f":"((SUM(B19:C19)/SUM(B16:C16)))","v":{"$error":"#VALUE!"}},{"$f":"((SUM(B19:D19)/SUM(B16:D16)))","v":{"$error":"#VALUE!"}},{"$f":"SUM(B19:E19)/SUM(B16:E16)","v":{"$error":"#VALUE!"}},{"$f":"SUM(B19:F19)/SUM(B16:F16)","v":{"$error":"#VALUE!"}},{"$f":"SUM(B19:G19)/SUM(B16:G16)","v":{"$error":"#VALUE!"}}]
["Final weight, kg",{"$f":"'Finisher Model - ME Metric'!C17","v":0},{"$f":"'Finisher Model - ME Metric'!C18","v":0},{"$f":"'Finisher Model - ME Metric'!C19","v":0},{"$f":"'Finisher Model - ME Metric'!C20","v":0},{"$f":"'Finisher Model - ME Metric'!C21","v":0},{"$f":"'Finisher Model - ME Metric'!C22","v":0},null,null,"Predicted F/G",{"$f":"IF('Finisher Model - ME Metric'!$D$11=2,L6,IF('Finisher Model - ME Metric'!$D$11=3,M6,IF('Finisher Model - ME Metric'!$D$11=4,N6,IF('Finisher Model - ME Metric'!$D$11=5,O6,IF('Finisher Model - ME Metric'!$D$11=6,P6,\"\")))))","v":""},{"$f":"SUM($B$17:$C$17)/SUM($B$19:$C$19)","v":{"$error":"#VALUE!"}},{"$f":"SUM($B$17:$D$17)/SUM($B$19:$D$19)","v":{"$error":"#VALUE!"}},{"$f":"SUM($B$17:$E$17)/SUM($B$19:$E$19)","v":{"$error":"#VALUE!"}},{"$f":"SUM($B$17:$F$17)/SUM($B$19:$F$19)","v":{"$error":"#VALUE!"}},{"$f":"SUM($B$17:$G$17)/SUM($B$19:$G$19)","v":{"$error":"#VALUE!"}}]
{"$rows_left_out":88}