{"text_format":"1","workbook":"xlsx","n_sheets":13,"sheets":["Instructions for Use","(1) Setup","(2) NE and SID Lysine","(3) Ractopamine","Growth Curve","(4) Temperature","(5) Feed Processing","(6) Floor Space","(7) Production Management","(8) Mortality","Summary","Sheet2","Sheet4"],"not_rendered":{"charts":9,"images":3,"macros":1,"external_links":1,"defined_names":42,"comments":0,"pivot_tables":0},"unopened":[],"bounds":{"document_bytes":16777216,"sheet_cells":100000,"rows_first":2000,"rows_last":500,"rows_between":2000,"halvings":0,"cell_chars":16384,"cell_head_chars":4096},"cells_cut":0,"cells_raw":0,"read":"whole","date_system":"1900"}

{"sheet":"Instructions for Use","index":0,"n_rows":40,"n_cols":16,"rows_kept":40,"cut":false,"hidden":false,"merged":[[3,1,3,11],[1,1,1,11],[20,1,20,11],[39,1,39,11],[31,1,31,11],[32,1,32,11],[33,1,33,11],[34,1,34,11],[35,1,35,11],[36,1,36,11],[25,1,25,11],[26,1,26,11],[28,1,28,11],[37,1,37,11],[38,1,38,11],[30,1,30,11],[7,1,7,11],[4,1,4,11],[29,1,29,11],[8,1,8,11],[9,1,9,11],[10,1,10,11],[11,1,11,11],[21,1,21,11],[22,1,22,11],[14,1,14,11],[15,1,15,11],[16,1,16,11],[17,1,17,11],[19,1,19,11],[23,1,23,11],[24,1,24,11]]}
[]
[null,"Feed Efficiency Evaluation Tool"]
[]
[null,"Created by: Jon De Jong, Kansas State University (© 2015, Jon De Jong, All Rights Reserved)"]
[null,"Instructions for Use"]
[]
[null,"Understanding the Spreadsheet"]
[null,"This tool is designed to allow producers to evaluate F/G using various scenarios from 7 areas of production. This spreadsheet is only designed to evaluate"]
[null,"pigs ranging from 50 - 300 lb BW. Each tab should be used separately from the others as not all areas of production and dietary formulation are additive in"]
[null,"regards to F/G. The last tab in the evaluator provides a summary of the 7 areas of production showing which area is capable of providing the largest"]
{"$rows_left_out":31}
{"sheet":"(1) Setup","index":1,"n_rows":74,"n_cols":47,"rows_kept":74,"cut":false,"hidden":false,"merged":[[1,0,1,13],[20,2,20,3],[12,2,12,3],[11,2,11,3],[22,2,22,3],[4,2,4,3],[6,2,6,3],[8,2,8,3],[3,4,3,13],[13,2,13,3],[3,2,3,3],[14,2,14,3]]}
[]
["Step 1: Setup"]
[null,null,null,null,null,null,null,null,null,null,null,null,null,null,null,null,null,null,null,null,null,null,null,null,null,null,null,10,null,"Diet Form",null,"Percentage Fines",null,null,null,"Paylean","Duration"]
["Select Inputs",null,"*Clears All Inputs",null,"Phases",null,null,null,null,null,null,null,null,null,null,null,null,null,null,null,null,null,null,null,null,null,null,15,null,"Meal ",null,0,null,325,null,0,0]
["Number of Dietary Phases",10,null,null,{"$f":"IF($B$5>0,1,\"\")","v":1},{"$f":"IF($B$5>1,2,\"\")","v":2},{"$f":"IF($B$5>2,3,\"\")","v":3},{"$f":"IF($B$5>3,4,\"\")","v":4},{"$f":"IF($B$5>4,5,\"\")","v":5},{"$f":"IF($B$5>5,6,\"\")","v":6},{"$f":"IF($B$5>6,7,\"\")","v":7},{"$f":"IF($B$5>7,8,\"\")","v":8},{"$f":"IF($B$5>8,9,\"\")","v":9},{"$f":"IF($B$5>9,10,\"\")","v":10},{"$f":"IF($B$5>10,11,\"\")","v":""},{"$f":"IF($B$5>11,12,\"\")","v":""},null,null,null,null,null,null,null,null,null,1,null,20,null,"Pellet",null,5,null,350,null,4.5,7]
[null,null,null,null,null,null,null,null,null,null,null,null,null,null,null,null,null,null,null,null,null,null,null,null,null,2,null,25,null,null,null,10,null,375,null,6.75,14,null,null,null,"baseline","Change","baseline ","change","FG","FG","% Change"]
["Starting Weight, lb",45,"Choose Starting Weight for All Phases",null,{"$f":"B7","v":45},90,110,130,155,185,200,225,245,265,null,null,null,null,null,null,null,null,null,null,null,3,null,30,null,null,null,15,null,400,null,9,21,null,null,2,4,6,4.5,6.5,{"$f":"AP7/AN7","v":3},{"$f":"AR7/AN7","v":3.25},{"$f":"AS7/AT7","v":0.92307692307692313}]
[null,null,null,null,null,null,null,null,null,null,null,null,null,null,null,null,null,null,null,null,null,null,null,null,null,4,null,35,null,null,null,20,null,425,null,null,28,null,null,3,4,6,4.5,6.5,{"$f":"AP8/AN8","v":2},{"$f":"AR8/AN8","v":2.1666666666666665},{"$f":"AS8/AT8","v":0.92307692307692313}]
["Ending Weight, lb",300,"*Choose ending weight of final phase",null,{"$f":"IF(E5=1,(IF(F5=\"\",B9,F7)),\"\")","v":90},{"$f":"IF(F5=2,(IF(G5=\"\",B9,G7)),\"\")","v":110},{"$f":"IF(G5=3,(IF(H5=\"\",B9,H7)),\"\")","v":130},{"$f":"IF(H5=4,(IF(I5=\"\",B9,I7)),\"\")","v":155},{"$f":"IF(I5=5,(IF(J5=\"\",B9,J7)),\"\")","v":185},{"$f":"IF(J5=6,(IF(K5=\"\",B9,K7)),\"\")","v":200},{"$f":"IF(K5=7,(IF(L5=\"\",B9,L7)),\"\")","v":225},{"$f":"IF(L5=8,(IF(M5=\"\",B9,M7)),\"\")","v":245},{"$f":"IF(M5=9,(IF(N5=\"\",B9,N7)),\"\")","v":265},{"$f":"IF(N5=10,(IF(O5=\"\",B9,O7)),\"\")","v":300},{"$f":"IF(O5=11,(IF(P5=\"\",B9,P7)),\"\")","v":""},{"$f":"IF(P5=12,(IF(Q5=\"\",B9,Q7)),\"\")","v":""},null,null,null,null,null,null,null,null,null,5,null,40,null,null,null,25,null,450,null,null,null,null,null,4,4,6,4.5,6.5,1.5,1.625,0.92307692307692313]
[null,null,null,null,null,null,null,null,null,null,null,null,null,null,null,null,null,null,null,null,null,null,null,null,null,6,null,45,null,null,null,30,null,475,null,null,null,null,null,5,4,6,4.5,6.5,1.2,1.3,0.92307692307692302]
{"$rows_left_out":65}
{"sheet":"(2) NE and SID Lysine","index":2,"n_rows":68,"n_cols":14,"rows_kept":68,"cut":false,"hidden":false,"merged":[[38,0,38,11],[24,2,24,11],[6,2,6,11],[0,0,0,12],[11,2,11,11]]}
["Step 2: Selecting Dietary NE and SID Lysine Levels"]
[]
[]
[]
[]
[]
[null,null,"Phase"]
[null,null,{"$f":"'(1) Setup'!E5","v":1},{"$f":"'(1) Setup'!F5","v":2},{"$f":"'(1) Setup'!G5","v":3},{"$f":"'(1) Setup'!H5","v":4},{"$f":"'(1) Setup'!I5","v":5},{"$f":"'(1) Setup'!J5","v":6},{"$f":"'(1) Setup'!K5","v":7},{"$f":"'(1) Setup'!L5","v":8},{"$f":"'(1) Setup'!M5","v":9},{"$f":"'(1) Setup'!N5","v":10}]
["Initial Weight, lb",null,{"$f":"IF(C8=1,'(1) Setup'!E7,\"\")","v":45},{"$f":"IF(D8=2,'(1) Setup'!F7,\"\")","v":90},{"$f":"IF(E8=3,'(1) Setup'!G7,\"\")","v":110},{"$f":"IF(F8=4,'(1) Setup'!H7,\"\")","v":130},{"$f":"IF(G8=5,'(1) Setup'!I7,\"\")","v":155},{"$f":"IF(H8=6,'(1) Setup'!J7,\"\")","v":185},{"$f":"IF(I8=7,'(1) Setup'!K7,\"\")","v":200},{"$f":"IF(J8=8,'(1) Setup'!L7,\"\")","v":225},{"$f":"IF(K8=9,'(1) Setup'!M7,\"\")","v":245},{"$f":"IF(L8=10,'(1) Setup'!N7,\"\")","v":265},null,{"$f":"'(1) Setup'!P5","v":""}]
["Ending Weight, lb",null,{"$f":"IF(C8=1,'(1) Setup'!E9,\"\")","v":90},{"$f":"IF(D8=2,'(1) Setup'!F9,\"\")","v":110},{"$f":"IF(E8=3,'(1) Setup'!G9,\"\")","v":130},{"$f":"IF(F8=4,'(1) Setup'!H9,\"\")","v":155},{"$f":"IF(G8=5,'(1) Setup'!I9,\"\")","v":185},{"$f":"IF(H8=6,'(1) Setup'!J9,\"\")","v":200},{"$f":"IF(I8=7,'(1) Setup'!K9,\"\")","v":225},{"$f":"IF(J8=8,'(1) Setup'!L9,\"\")","v":245},{"$f":"IF(K8=9,'(1) Setup'!M9,\"\")","v":265},{"$f":"IF(L8=10,'(1) Setup'!N9,\"\")","v":300}]
{"$rows_left_out":59}
{"sheet":"(3) Ractopamine","index":3,"n_rows":73,"n_cols":37,"rows_kept":73,"cut":false,"hidden":false,"merged":[[0,0,0,10],[1,1,1,12],[0,12,0,15]]}
[null,null,null,null,null,null,null,null,null,null,null,null,"Step 3: Ractopamine Inclusion and Feeding Duration"]
[]
[]
[]
[]
[]
[]
[null,{"$f":"'(1) Setup'!E5","v":1},{"$f":"'(1) Setup'!F5","v":2},{"$f":"'(1) Setup'!G5","v":3},{"$f":"'(1) Setup'!H5","v":4},{"$f":"'(1) Setup'!I5","v":5},{"$f":"'(1) Setup'!J5","v":6},{"$f":"'(1) Setup'!K5","v":7},{"$f":"'(1) Setup'!L5","v":8},{"$f":"'(1) Setup'!M5","v":9},{"$f":"'(1) Setup'!N5","v":10},null,null,"Current Scenario","Scenario 1","Scenario 2"]
[null,{"$f":"IF(B8=1,'(1) Setup'!E7,0)","v":45},{"$f":"IF(C8=2,'(1) Setup'!F7,0)","v":90},{"$f":"IF(D8=3,'(1) Setup'!G7,0)","v":110},{"$f":"IF(E8=4,'(1) Setup'!H7,0)","v":130},{"$f":"IF(F8=5,'(1) Setup'!I7,0)","v":155},{"$f":"IF(G8=6,'(1) Setup'!J7,0)","v":185},{"$f":"IF(H8=7,'(1) Setup'!K7,0)","v":200},{"$f":"IF(I8=8,'(1) Setup'!L7,0)","v":225},{"$f":"IF(J8=9,'(1) Setup'!M7,0)","v":245},{"$f":"IF(K8=10,'(1) Setup'!N7,0)","v":265},null,"Ractopamine g/ton",{"$f":"'(1) Setup'!B14","v":9}]
[null,{"$f":"IF(B8=1,'(1) Setup'!E9,0)","v":90},{"$f":"IF(C8=2,'(1) Setup'!F9,0)","v":110},{"$f":"IF(D8=3,'(1) Setup'!G9,0)","v":130},{"$f":"IF(E8=4,'(1) Setup'!H9,0)","v":155},{"$f":"IF(F8=5,'(1) Setup'!I9,0)","v":185},{"$f":"IF(G8=6,'(1) Setup'!J9,0)","v":200},{"$f":"IF(H8=7,'(1) Setup'!K9,0)","v":225},{"$f":"IF(I8=8,'(1) Setup'!L9,0)","v":245},{"$f":"IF(J8=9,'(1) Setup'!M9,0)","v":265},{"$f":"IF(K8=10,'(1) Setup'!N9,0)","v":300},null,"Duration, d",{"$f":"'(1) Setup'!E14","v":17}]
{"$rows_left_out":64}
{"sheet":"Growth Curve","index":4,"n_rows":218,"n_cols":36,"rows_kept":218,"cut":false,"hidden":true,"merged":[[0,1,0,11],[0,13,0,23],[2,1,2,11],[2,13,2,23]]}
[null,"K-State Growth and Feed Intake Curve Calculator",null,null,null,null,null,null,null,null,null,null,null,"K-State Growth and Feed Intake Curve Calculator"]
[]
[null,"Information in yellow cells can be changed.",null,null,null,null,null,null,null,null,null,null,null,"Information in yellow cells can be changed.",null,null,null,null,null,null,null,null,null,null,null,null,"Day","Weight","Day","ADG","Cum Feed","Feed/d"]
[null,null,"Model and Template: Dr. Steve Dritz, K-State College of Veterinary Medicine",null,null,null,null,null,null,null,null,null,null,null,"Model and Template: Dr. Steve Dritz, K-State College of Veterinary Medicine",null,null,null,null,null,null,null,null,null,null,null,null,{"$f":"R7","v":12.125300000000001},null,null,{"$f":"IF(AB4<$R$13,(-0.00011*$AB4^3+0.02188*$AB4^2 + 0.80366*$AB4 - 9.4)*$U$7/1.775,(0.00463*$AB4^2 + 1.68*$AB4 - 22.05)*$U$11/3.069)","v":3.1252847240805819},null,null,{"$f":"((0.004404447*(21+AA4)^2+0.08509693*(21+AA4)+2.014352066)/(((0.004404447*((($F$13-$F$7)/($J$7/1000))+21)^2+0.08509693*((($F$13-$F$7)/($J$7/1000))+21)+2.014352066)-(0.004404447*(21)^2+0.08509693*21+2.014352066)))*($F$13-$F$7))","v":5.2896190581174425}]
[null,null,null,null,null,"Nursery Close Out Averages",null,null,null,null,null,null,null,null,null,null,null,"Nursery Close Out Averages",null,null,null,null,null,null,null,null,1,{"$f":"IF(AB4<60,AJ5*2.2046,( -0.0000000283*AB4^3 - 0.0000208677*AB4^2 + 0.0088789486*AB4+ 1.0393148087+($V$11-1.68))+AB4)","v":12.682591436047618},1,{"$f":"AB5-AB4","v":0.55729143604761688},3.7958384023059799,{"$f":"AE5-AE4","v":0.67055367822539802},null,{"$f":"((0.004404447*(21+AA5)^2+0.08509693*(21+AA5)+2.014352066)/(((0.004404447*((($F$13-$F$7)/($J$7/1000))+21)^2+0.08509693*((($F$13-$F$7)/($J$7/1000))+21)+2.014352066)-(0.004404447*(21)^2+0.08509693*21+2.014352066)))*($F$13-$F$7))","v":5.5424047952342059},{"$f":"AH5-AH4","v":0.25278573711676344},{"$f":"$F$7+AI5","v":5.7527857371167634}]
[null,null,null,null,null,"Initial wt","Final wt","F/G","Adj. F/G","ADG, g",null,null,null,null,null,null,null,"Initial wt","Final wt","F/G","Adj. F/G","ADG",null,null,null,null,2,{"$f":"IF(AB5<60,AJ6*2.2046,( -0.0000000283*AB5^3 - 0.0000208677*AB5^2 + 0.0088789486*AB5+ 1.0393148087+($V$11-1.68))+AB5)","v":13.257767509990771},2,0.57517607394315284,4.498613852229127,0.70277544992314711,null,5.8033029508829195,{"$f":"AH6-AH5","v":0.26089815564871355},{"$f":"AJ5+AI6","v":6.013683892765477}]
[null,null,null,null,null,5.5,{"$f":"F11","v":20.417422867513611},1.5,{"$f":"$T$7-((G7-10)*0.011)+((50-H7)*0.011)","v":1.9189083484573501},400,null,null,null,null,null,null,null,{"$f":"F7*2.2046","v":12.125300000000001},{"$f":"R11","v":45.012250453720512},{"$f":"H7","v":1.5},{"$f":"$T$7-((S7-10)*0.011)+((50-T7)*0.011)","v":1.6483652450090744},{"$f":"J7*2.2046/1000","v":0.88184000000000007},null,null,null,null,3,13.850828221829465,3,0.59306071183869413,5.2345030561014569,0.73588920387232992,null,6.072313525063584,0.26901057418066454,{"$f":"AJ6+AI7","v":6.2826944669461415}]
[null,null,null,null,null,null,null,null,null,null,null,null,null,null,null,null,null,null,null,null,null,null,null,null,null,null,4,14.461773571563697,4,0.61094534973423187,6.0044067449576097,0.76990368885615279,null,6.3494365177761996,0.27712299271261553,6.5598174596587571]
[null,null,null,null,null,"Finisher Close Out Averages",null,null,null,null,null,null,null,null,null,null,null,"Finisher Close Out Averages",null,null,null,null,null,null,null,null,5,15.09060355919347,5,0.62882998762977316,6.8092326546023401,0.80482590964473033,null,6.634671929020767,0.28523541124456742,6.8450528709033245]
[null,null,null,null,null,"Initial wt","Final wt","F/G","Adj. F/G","ADG, g",null,null,null,null,null,null,null,"Initial wt","Final wt","F/G","Adj. F/G","ADG",null,null,null,null,6,15.737318184718784,6,0.64671462552531445,7.6498937290040576,0.84066107440171756,null,6.9280197587972863,0.2933478297765193,7.1384007006798438]
{"$rows_left_out":209}
{"sheet":"(4) Temperature","index":5,"n_rows":402,"n_cols":48,"rows_kept":402,"cut":false,"hidden":false,"merged":[[18,2,18,11],[3,21,3,22],[0,2,0,11],[10,2,10,11],[1,2,1,11],[3,17,3,18],[14,2,14,11]]}
[null,null,"Step 4: Effects of Effective Environmental Temperature on F/G"]
[null,null,"Phase"]
[null,null,{"$f":"'(1) Setup'!E5","v":1},{"$f":"'(1) Setup'!F5","v":2},{"$f":"'(1) Setup'!G5","v":3},{"$f":"'(1) Setup'!H5","v":4},{"$f":"'(1) Setup'!I5","v":5},{"$f":"'(1) Setup'!J5","v":6},{"$f":"'(1) Setup'!K5","v":7},{"$f":"'(1) Setup'!L5","v":8},{"$f":"'(1) Setup'!M5","v":9},{"$f":"'(1) Setup'!N5","v":10},{"$f":"'(1) Setup'!O5","v":""},null,{"$f":"'(1) Setup'!P5","v":""}]
["Initial Weight, lb",null,{"$f":"IF(C3=\"\",\"\",'(1) Setup'!E7)","v":45},{"$f":"IF(D3=\"\",\"\",'(1) Setup'!F7)","v":90},{"$f":"IF(E3=\"\",\"\",'(1) Setup'!G7)","v":110},{"$f":"IF(F3=\"\",\"\",'(1) Setup'!H7)","v":130},{"$f":"IF(G3=\"\",\"\",'(1) Setup'!I7)","v":155},{"$f":"IF(H3=\"\",\"\",'(1) Setup'!J7)","v":185},{"$f":"IF(I3=\"\",\"\",'(1) Setup'!K7)","v":200},{"$f":"IF(J3=\"\",\"\",'(1) Setup'!L7)","v":225},{"$f":"IF(K3=\"\",\"\",'(1) Setup'!M7)","v":245},{"$f":"IF(L3=\"\",\"\",'(1) Setup'!N7)","v":265},null,null,null,null,null,"Zhang",null,null,null,"PIC"]
["Final Weight, lb",null,{"$f":"'(1) Setup'!E9","v":90},{"$f":"'(1) Setup'!F9","v":110},{"$f":"'(1) Setup'!G9","v":130},{"$f":"'(1) Setup'!H9","v":155},{"$f":"'(1) Setup'!I9","v":185},{"$f":"'(1) Setup'!J9","v":200},{"$f":"'(1) Setup'!K9","v":225},{"$f":"'(1) Setup'!L9","v":245},{"$f":"'(1) Setup'!M9","v":265},{"$f":"'(1) Setup'!N9","v":300},{"$f":"IF(M3=11,(AVERAGE('(1) Setup'!O7,'(1) Setup'!O9)),\"\")","v":""},null,{"$f":"IF(O3=12,(AVERAGE('(1) Setup'!P7,'(1) Setup'!P9)),\"\")","v":""},null,"Weight","Winter ","Summer",null,null,"Weight","Temp",null,"Phase","Wt","Requirement","Adapted from Baker et al. (2004) & Mount (1975)",null,null,null,null,null,null,null,null,null,"Phase",{"$f":"C3","v":1},2,3,4,5,6,7,8,9,10]
["Ambient Temperature Requirement",null,{"$f":"VLOOKUP(AVERAGE(C4:C5),$V$6:$W$402,2,TRUE)","v":70.81919999999991},66.961539999999999,66.192339999999987,64.827594999999903,62.857279999999946,61.645900000000012,61,61,61,61,null,null,null,null,7,29,28,null,null,7,89,null,1,{"$f":"C5","v":90},{"$f":"IF(Z6=\"\",\"\",VLOOKUP(Z6,V6:W402,2,TRUE))","v":68.039899999999918},null,null,null,null,null,null,null,null,null,null,"Wt",{"$f":"AVERAGE(C4,C5)","v":67.5},100,120,142.5,170,192.5,212.5,235,255,282.5]
["Upper Critical Temperature¹",null,{"$f":"IF(C3=\"\",\"\",C8+(C8-C9))","v":81.326520813762556},{"$f":"IF(D3=\"\",\"\",D8+(D8-D9))","v":80.307830747311812},79.63869606488683,78.885784217363096,77.889343865165642,77.113492168953584,76.408299817841325,75.616469743456008,74.900181844729971,73.854680964785913]
["Estimated Temperature Requirement",null,{"$f":"IF(C3=\"\",\"\",((VLOOKUP(C27,$C$90:$E$275,3,TRUE))*(9/5)+32))","v":75.66132203373428},{"$f":"IF(D3=\"\",\"\",((VLOOKUP(D27,$C$90:$E$275,3,TRUE))*(9/5)+32))","v":74.284834698045813},73.398260827361341,72.415268864117166,71.134926839961793,70.151739867351864,69.266469502491105,68.280923635070721,67.395939032348224,66.115953633744482,null,null,null,null,20,26,24,null,null,8,89,null,2,{"$f":"D5","v":110},{"$f":"IF(Z8=\"\",\"\",VLOOKUP(Z8,V8:W404,2,TRUE))","v":66.576939999999993},"Floor",null,"Air Speed",null,"Building Insulation",null,"Evaporative Cooling",null,"Radiant Heat",null,"Est F/G",{"$f":"'(2) NE and SID Lysine'!C15","v":1.9177965021464118},{"$f":"'(2) NE and SID Lysine'!D15","v":2.0837273693773923},{"$f":"'(2) NE and SID Lysine'!E15","v":2.2009129457586143},{"$f":"'(2) NE and SID Lysine'!F15","v":2.3495658534939974},{"$f":"'(2) NE and SID Lysine'!G15","v":2.5609762126589106},{"$f":"'(2) NE and SID Lysine'!H15","v":2.7644948831219667},{"$f":"'(2) NE and SID Lysine'!I15","v":2.9746198518345239},{"$f":"'(2) NE and SID Lysine'!J15","v":3.2527619138802573},{"$f":"'(2) NE and SID Lysine'!K15","v":3.5476249819531938},{"$f":"'(2) NE and SID Lysine'!L15","v":3.4583205814923201}]
["Lower Critical Temperature¹",null,{"$f":"IF(C3=\"\",\"\",((VLOOKUP(C27,$C$90:$G$275,5,TRUE))*(9/5)+32))","v":69.996123253706003},{"$f":"IF(D3=\"\",\"\",((VLOOKUP(D27,$C$90:$G$275,5,TRUE))*(9/5)+32))","v":68.261838648779815},67.157825589835852,65.944753510871237,64.380509814757943,63.189987565750144,62.124639187140886,60.945377526685434,59.891696219966477,58.37722630270305]
["Cumulative Days on Feed",null,{"$f":"IF(C3=\"\",\"\",C65)","v":24.541053203073666},{"$f":"IF(D3=\"\",\"\",(C10+D65))","v":34.182864253880879},{"$f":"IF(E3=\"\",\"\",(D10+E65))","v":43.330488064923358},54.297219016607343,67.082571120395386,73.431766041180353,84.080820883992558,92.7837325530773,101.77298129286613,118.60465116279072]
{"$rows_left_out":393}
{"sheet":"(5) Feed Processing","index":6,"n_rows":38,"n_cols":38,"rows_kept":38,"cut":false,"hidden":false,"merged":[[15,22,15,24],[16,17,16,20],[16,27,16,30],[15,34,15,37],[0,1,0,8],[2,0,2,3],[2,5,2,8],[1,0,1,8],[15,13,15,15]]}
[null,null,null,null,null,null,null,null,null,null,null,null,null,"Meal","V-Lookup For Diet Form","Meal",1]
["Step 5: Evaluating Feed Processing Technologies",null,null,null,null,null,null,null,null,null,null,null,null,"Pellet",null,"Pellet",2]
["Pellet vs. Meal Diets",null,null,null,null,"Particle Size of Meal Diets "]
[null,"Initial Scenario","Scenario 1","Scenario 2",null,null,"Initial Scenario","Scenario 1","Scenario 2"]
["Diet form",{"$f":"'(1) Setup'!B12","v":"Pellet"},null,null,null,"Grain Particle Size, µ",{"$f":"'(1) Setup'!B13","v":550}]
[null,{"$f":"VLOOKUP(B5,$P$1:$Q$2,2,TRUE)","v":2},{"$f":"VLOOKUP(C5,$P$1:$Q$2,2,TRUE)","v":{"$error":"#N/A"}},{"$f":"VLOOKUP(D5,$P$1:$Q$2,2,TRUE)","v":{"$error":"#N/A"}}]
["Percentage Fines, %",{"$f":"'(1) Setup'!E12","v":55},null,null,null,"Overall F/G",{"$f":"'(1) Setup'!B21","v":2.75},{"$f":"IF(H5=\"\",0,($G$7-H10))","v":0},{"$f":"IF(I5=\"\",0,($G$7-I10))","v":0}]
["Overall F/G",{"$f":"'(1) Setup'!B21","v":2.75},{"$f":"$B$8-C11+C13+(IF(C7<$B$7,-C14,C14))","v":{"$error":"#N/A"}},{"$f":"$B$8-D11+D13+(IF(D7<$B$7,-D14,D14))","v":{"$error":"#N/A"}},null,"% Change",null,{"$f":"IF(H5=\"\",0,ABS(($G$7-H7)/$G$7))","v":0},{"$f":"IF(I5=\"\",0,ABS(($G$7-I7)/$G$7))","v":0}]
[]
["Initial F/G",{"$f":"B8","v":2.75},{"$f":"IF($B$5=\"Meal\",IF(C8>$B$8,$B$10,C8),C8)","v":{"$error":"#N/A"}},{"$f":"IF($B$5=\"Meal\",IF(D8>$B$8,$B$10,D8),D8)","v":{"$error":"#N/A"}},null,null,"Change",{"$f":"($G$5-H5)*0.000302","v":0.16610000000000003},{"$f":"($G$5-I5)*0.000302","v":0.16610000000000003}]
{"$rows_left_out":29}
{"sheet":"(6) Floor Space","index":7,"n_rows":17,"n_cols":7,"rows_kept":17,"cut":false,"hidden":false,"merged":[[0,0,0,3]]}
["Step 6: Effects of Floor Space on F/G"]
[null,"Initial","Scenario 1","Scenario 2","Scenario 3","Scenario 4","Scenario 5"]
["Initial BW, lb",{"$f":"'(1) Setup'!B7","v":45},{"$f":"$B$3","v":45},{"$f":"$B$3","v":45},{"$f":"$B$3","v":45},{"$f":"$B$3","v":45},{"$f":"$B$3","v":45}]
["Final BW, lb",{"$f":"'(1) Setup'!B9","v":300},{"$f":"$B$4","v":300},{"$f":"$B$4","v":300},{"$f":"$B$4","v":300},{"$f":"$B$4","v":300},{"$f":"$B$4","v":300}]
["Initial BW, kg",{"$f":"B3/2.204","v":20.417422867513611},{"$f":"C3/2.204","v":20.417422867513611},20.417422867513611,20.417422867513611,20.417422867513611,20.417422867513611]
["Final BW, kg",{"$f":"B4/2.204","v":136.11615245009074},{"$f":"C4/2.204","v":136.11615245009074},136.11615245009074,136.11615245009074,136.11615245009074,136.11615245009074]
["Floor Space/Pig, ft2",{"$f":"'(1) Setup'!B17","v":7.8},null,null,5.5,8,7.5]
["Floor Space/Pig, m2",{"$f":"B7*0.092903","v":0.72464339999999994},{"$f":"C7*0.092903","v":0},0,0.51096649999999999,0.743224,0.69677250000000002]
["Final BW(kg)^.667",{"$f":"B4^0.667","v":44.899331706525246},{"$f":"C4^0.667","v":44.899331706525246},{"$f":"D4^0.667","v":44.899331706525246},{"$f":"#REF!^0.667","v":{"$error":"#REF!"}},{"$f":"#REF!^0.667","v":{"$error":"#REF!"}},{"$f":"#REF!^0.667","v":{"$error":"#REF!"}}]
["Initial K value",{"$f":"B8/B9","v":1.6139291442832035E-2},0,0,{"$error":"#REF!"},{"$error":"#REF!"},{"$error":"#REF!"}]
{"$rows_left_out":8}
{"sheet":"(7) Production Management","index":8,"n_rows":25,"n_cols":17,"rows_kept":25,"cut":false,"hidden":false,"merged":[[3,5,3,14],[9,5,9,14],[7,1,7,2],[13,5,13,14],[2,1,2,16]]}
[]
[]
[null,"Step 7: Production Management Changes"]
[null,null,null,null,null,"Phase"]
[null,null,null,null,"Phase",{"$f":"'(1) Setup'!E5","v":1},{"$f":"'(1) Setup'!F5","v":2},{"$f":"'(1) Setup'!G5","v":3},{"$f":"'(1) Setup'!H5","v":4},{"$f":"'(1) Setup'!I5","v":5},{"$f":"'(1) Setup'!J5","v":6},{"$f":"'(1) Setup'!K5","v":7},{"$f":"'(1) Setup'!L5","v":8},{"$f":"'(1) Setup'!M5","v":9},{"$f":"'(1) Setup'!N5","v":10}]
[null,null,null,null,"Intial Weight",{"$f":"IF(F5=\"\",\"\",'(1) Setup'!E7)","v":45},{"$f":"IF(G5=\"\",\"\",'(1) Setup'!F7)","v":90},{"$f":"IF(H5=\"\",\"\",'(1) Setup'!G7)","v":110},{"$f":"IF(I5=\"\",\"\",'(1) Setup'!H7)","v":130},{"$f":"IF(J5=\"\",\"\",'(1) Setup'!I7)","v":155},{"$f":"IF(K5=\"\",\"\",'(1) Setup'!J7)","v":185},{"$f":"IF(L5=\"\",\"\",'(1) Setup'!K7)","v":200},{"$f":"IF(M5=\"\",\"\",'(1) Setup'!L7)","v":225},{"$f":"IF(N5=\"\",\"\",'(1) Setup'!M7)","v":245},{"$f":"IF(O5=\"\",\"\",'(1) Setup'!N7)","v":265}]
[null,null,null,null,"Final Weight",{"$f":"IF(F5=\"\",\"\",'(1) Setup'!E9)","v":90},{"$f":"IF(G5=\"\",\"\",'(1) Setup'!F9)","v":110},{"$f":"IF(H5=\"\",\"\",'(1) Setup'!G9)","v":130},{"$f":"IF(I5=\"\",\"\",'(1) Setup'!H9)","v":155},{"$f":"IF(J5=\"\",\"\",'(1) Setup'!I9)","v":185},{"$f":"IF(K5=\"\",\"\",'(1) Setup'!J9)","v":200},{"$f":"IF(L5=\"\",\"\",'(1) Setup'!K9)","v":225},{"$f":"IF(M5=\"\",\"\",'(1) Setup'!L9)","v":245},{"$f":"IF(N5=\"\",\"\",'(1) Setup'!M9)","v":265},{"$f":"IF(O5=\"\",\"\",'(1) Setup'!N9)","v":300},"Initial Overall F/G"]
[null,"Production Change to Evaluate",null,null,"Initial F/G",{"$f":"'(2) NE and SID Lysine'!C54","v":1.9764372634899374},{"$f":"'(2) NE and SID Lysine'!D54","v":2.1474418246055014},{"$f":"'(2) NE and SID Lysine'!E54","v":2.2682106025463171},{"$f":"'(2) NE and SID Lysine'!F54","v":2.421408893316749},{"$f":"'(2) NE and SID Lysine'!G54","v":2.6392835798508401},{"$f":"'(2) NE and SID Lysine'!H54","v":2.8490252722926193},{"$f":"'(2) NE and SID Lysine'!I54","v":3.0655752647909633},{"$f":"'(2) NE and SID Lysine'!J54","v":3.3522221198435482},{"$f":"'(2) NE and SID Lysine'!K54","v":3.6561012617202135},{"$f":"'(2) NE and SID Lysine'!L54","v":3.5822430305229047},{"$f":"SUM(F23:O23)/SUM(F22:O22)","v":2.7524948609108542}]
[null,"Production Change","Expected F/G Response, % "]
[null,"A",0.05,null,null,"Select the change to be used in each phase, Scenario 1"]
{"$rows_left_out":16}
{"sheet":"(8) Mortality","index":9,"n_rows":24,"n_cols":10,"rows_kept":24,"cut":false,"hidden":false,"merged":[[3,0,3,8]]}
[]
[]
[]
["Step 8: Effects of Mortality on F/G"]
[null,"0% Mortality","Initial","Scenario 1","Scenario 2","Scenario 3","Scenario 4","Scenario 5","Scenario 6"]
["Initial BW, lb",{"$f":"'(1) Setup'!$B$7","v":45},{"$f":"'(1) Setup'!$B$7","v":45},{"$f":"'(1) Setup'!$B$7","v":45},{"$f":"'(1) Setup'!$B$7","v":45},{"$f":"'(1) Setup'!$B$7","v":45},{"$f":"'(1) Setup'!$B$7","v":45},{"$f":"'(1) Setup'!$B$7","v":45},{"$f":"'(1) Setup'!$B$7","v":45}]
["Final BW, lb",{"$f":"'(1) Setup'!$B$9","v":300},{"$f":"'(1) Setup'!$B$9","v":300},{"$f":"'(1) Setup'!$B$9","v":300},{"$f":"'(1) Setup'!$B$9","v":300},{"$f":"'(1) Setup'!$B$9","v":300},{"$f":"'(1) Setup'!$B$9","v":300},{"$f":"'(1) Setup'!$B$9","v":300},{"$f":"'(1) Setup'!$B$9","v":300}]
["Mortality, %",0,{"$f":"'(1) Setup'!B15","v":0.02},null,null,0.08,0.1,0.12,0.09,"*Pig mortalites are assumed to have consumed 50% of the feed budget"]
["Overall F/G",{"$f":"C9","v":2.75},{"$f":"'(1) Setup'!B21","v":2.75}]
[]
{"$rows_left_out":15}
{"sheet":"Summary","index":10,"n_rows":38,"n_cols":6,"rows_kept":38,"cut":false,"hidden":false,"merged":[[34,0,34,1],[34,2,34,3],[34,4,34,5],[1,0,1,1],[1,2,1,3],[25,0,25,1],[25,2,25,3],[25,4,25,5],[30,0,30,1],[30,2,30,3],[30,4,30,5],[11,4,11,5],[11,2,11,3],[11,0,11,1],[15,0,15,1],[15,2,15,3],[15,4,15,5],[0,0,0,1],[0,2,0,3],[0,4,0,5],[5,0,5,1],[5,2,5,3],[5,4,5,5]]}
["Current Practice",null,"Scenario 1",null,"Scenario 2"]
["NE and SID lysine",null,"NE and SID lysine"]
["       F/G",{"$f":"'(2) NE and SID Lysine'!M23","v":2.7524948609108542},"       F/G",{"$f":"'(2) NE and SID Lysine'!M34","v":0}]
[null,null,"       % Change",{"$f":"'(2) NE and SID Lysine'!M35","v":0}]
[]
["Ractopamine",null,"Ractopamine",null,"Ractopamine"]
["       Level, g/ton",{"$f":"'(3) Ractopamine'!N9","v":9},"       Level, g/ton",{"$f":"'(3) Ractopamine'!O9","v":0},"       Level, g/ton",{"$f":"'(3) Ractopamine'!P9","v":0}]
["       Duration, d",{"$f":"'(3) Ractopamine'!N10","v":17},"       Duration, d",{"$f":"'(3) Ractopamine'!O10","v":0},"       Duration, d",{"$f":"'(3) Ractopamine'!P10","v":0}]
["       F/G",{"$f":"'(3) Ractopamine'!N11","v":2.75},"       F/G",{"$f":"'(3) Ractopamine'!O11","v":0},"       F/G",{"$f":"'(3) Ractopamine'!P11","v":0}]
[null,null,"       % Change",{"$f":"'(3) Ractopamine'!O12","v":0},"       % Change",{"$f":"'(3) Ractopamine'!P12","v":0}]
{"$rows_left_out":29}
{"sheet":"Sheet2","index":11,"n_rows":2,"n_cols":1,"rows_kept":2,"cut":false,"hidden":false,"merged":[]}
[{"$f":"1/((0.000096*(1145*2.204))-(0.0025*(AVERAGE(22.686,54.446)))+(0.003071*1.5)+0.3257)","v":2.1001556677384041}]
[{"$f":"1/((0.000096*(1166*2.204))-(0.0025*(AVERAGE(54.446,90.744)))+(0.003071*1.5)+0.3257)","v":2.5282791563225495}]

{"sheet":"Sheet4","index":12,"n_rows":0,"n_cols":0,"rows_kept":0,"cut":false,"hidden":false,"merged":[]}